{"text_format":"1","workbook":"xlsx","n_sheets":6,"sheets":["RWJF Population Model","Update Preparations","Data Dictionary","Input","Drop Down Lists","Macro_Data"],"not_rendered":{"charts":4,"images":0,"macros":1,"external_links":0,"defined_names":5,"comments":0,"pivot_tables":1},"unopened":[],"bounds":{"document_bytes":16777216,"sheet_cells":100000,"rows_first":2000,"rows_last":500,"rows_between":2000,"halvings":0,"cell_chars":16384,"cell_head_chars":4096},"cells_cut":0,"cells_raw":0,"read":"part_too_large","date_system":"1900"}

{"sheet":"RWJF Population Model","index":0,"n_rows":189,"n_cols":99,"rows_kept":189,"cut":false,"hidden":false,"merged":[[155,40,155,50],[156,40,156,50],[157,40,157,50],[12,56,13,97],[12,1,13,11],[110,11,110,27],[111,11,111,27],[53,25,53,41],[97,39,97,44],[98,39,98,44],[99,39,99,44],[152,40,152,50],[153,40,153,50],[154,40,154,50],[55,10,55,22],[51,10,51,22],[49,10,49,22],[47,10,47,22],[57,88,57,96],[55,88,55,96],[53,88,53,96],[51,88,51,96],[49,88,49,96],[47,88,47,96],[57,78,57,86],[55,78,55,86],[53,78,53,86],[51,78,51,86],[49,78,49,86],[47,78,47,86],[57,68,57,76],[55,68,55,76],[53,68,53,76],[51,68,51,76],[49,68,49,76],[47,68,47,76],[53,4,53,22],[182,28,182,38],[183,28,183,38],[184,28,184,38],[185,28,185,38],[186,28,186,38],[187,28,187,38],[170,28,170,38],[171,28,171,38],[172,28,172,38],[173,28,173,38],[174,28,174,38],[175,28,175,38],[176,28,176,38],[177,28,177,38],[178,28,178,38],[95,11,95,27],[96,11,96,27],[97,11,97,27],[158,28,158,38],[163,28,163,38],[164,28,164,38],[165,28,165,38],[161,28,161,38],[168,40,168,50],[169,40,169,50],[170,40,170,50],[171,40,171,50],[179,28,179,38],[180,28,180,38],[181,28,181,38],[166,28,166,38],[167,28,167,38],[168,28,168,38],[127,59,127,72],[188,28,188,38],[152,28,152,38],[153,28,153,38],[154,28,154,38],[155,28,155,38],[156,28,156,38],[131,59,131,72],[132,59,132,72],[133,59,133,72],[134,59,134,72],[135,59,135,72],[133,42,133,55],[132,42,132,55],[161,40,161,50],[162,40,162,50],[163,40,163,50],[164,40,164,50],[165,40,165,50],[169,28,169,38],[150,28,150,38],[157,28,157,38],[166,40,166,50],[167,40,167,50],[57,58,57,66],[55,58,55,66],[53,58,53,66],[51,58,51,66],[49,58,49,66],[47,58,47,66],[55,45,55,56],[53,45,53,56],[51,45,51,56],[49,45,49,56],[57,45,57,56],[162,28,162,38],[159,28,159,38],[160,28,160,38],[185,2,185,17],[180,19,180,21],[181,19,181,21],[182,19,182,21],[183,19,183,21],[184,19,184,21],[171,2,171,17],[172,2,172,17],[173,2,173,17],[174,2,174,17],[175,2,175,17],[176,2,176,17],[177,2,177,17],[178,2,178,17],[175,19,175,21],[167,19,167,21],[168,19,168,21],[169,19,169,21],[170,19,170,21],[171,19,171,21],[172,19,172,21],[87,72,87,77],[97,72,97,77],[118,76,118,89],[98,72,98,77],[99,72,99,77],[100,72,100,77],[186,2,186,17],[187,2,187,17],[188,2,188,17],[166,2,166,17],[167,2,167,17],[168,2,168,17],[169,2,169,17],[170,2,170,17],[176,19,176,21],[177,19,177,21],[178,19,178,21],[179,19,179,21],[179,2,179,17],[180,2,180,17],[181,2,181,17],[182,2,182,17],[183,2,183,17],[184,2,184,17],[125,76,125,89],[126,76,126,89],[127,76,127,89],[128,76,128,89],[129,76,129,89],[130,76,130,89],[131,76,131,89],[122,76,122,89],[123,76,123,89],[124,76,124,89],[129,59,129,72],[140,25,140,38],[137,76,137,89],[138,76,138,89],[139,76,139,89],[140,76,140,89],[136,59,136,72],[137,59,137,72],[138,59,138,72],[139,59,139,72],[140,59,140,72],[139,42,139,55],[140,42,140,55],[138,42,138,55],[137,42,137,55],[136,42,136,55],[130,59,130,72],[136,76,136,89],[132,76,132,89],[133,76,133,89],[134,76,134,89],[135,76,135,89],[129,42,129,55],[130,42,130,55],[120,76,120,89],[121,76,121,89],[124,59,124,72],[120,25,120,38],[121,25,121,38],[122,25,122,38],[123,25,123,38],[120,42,120,55],[121,42,121,55],[122,42,122,55],[123,42,123,55],[101,39,101,44],[109,39,109,44],[110,39,110,44],[111,39,111,44],[102,39,102,44],[103,39,103,44],[104,39,104,44],[105,39,105,44],[106,39,106,44],[128,59,128,72],[124,42,124,55],[125,42,125,55],[126,42,126,55],[127,42,127,55],[128,42,128,55],[105,11,105,27],[106,11,106,27],[111,45,111,50],[107,11,107,27],[108,11,108,27],[127,11,127,21],[128,11,128,21],[108,33,108,38],[107,33,107,38],[120,59,120,72],[121,59,121,72],[122,59,122,72],[123,59,123,72],[118,59,118,72],[118,25,118,38],[109,11,109,27],[125,59,125,72],[126,59,126,72],[49,25,49,41],[137,11,137,21],[138,11,138,21],[87,11,87,27],[88,11,88,27],[89,11,89,27],[90,11,90,27],[91,11,91,27],[92,11,92,27],[102,11,102,27],[103,11,103,27],[104,11,104,27],[98,11,98,27],[99,11,99,27],[100,11,100,27],[101,11,101,27],[93,11,93,27],[94,11,94,27],[92,39,92,44],[93,39,93,44],[110,33,110,38],[106,33,106,38],[85,33,85,62],[123,11,123,21],[18,40,18,49],[22,40,22,49],[24,40,24,49],[35,40,35,49],[39,40,39,49],[32,40,32,49],[26,40,26,49],[46,25,47,41],[24,9,24,38],[22,9,22,38],[39,2,39,38],[18,8,18,38],[26,10,26,38],[20,40,20,49],[35,5,35,38],[20,2,20,38],[47,45,47,56],[45,45,46,96],[27,73,36,97],[37,73,39,97],[18,73,26,97],[85,66,85,89],[55,25,55,41],[90,78,90,83],[91,78,91,83],[86,39,86,44],[86,45,86,50],[86,51,86,56],[87,39,87,44],[88,39,88,44],[89,39,89,44],[90,39,90,44],[91,39,91,44],[87,78,87,83],[88,78,88,83],[89,78,89,83],[88,51,88,56],[89,51,89,56],[90,51,90,56],[91,51,91,56],[87,51,87,56],[86,84,86,89],[88,72,88,77],[89,72,89,77],[90,72,90,77],[91,72,91,77],[92,66,92,71],[97,45,97,50],[98,45,98,50],[99,45,99,50],[92,51,92,56],[93,51,93,56],[94,51,94,56],[95,51,95,56],[96,51,96,56],[99,57,99,62],[97,57,97,62],[98,57,98,62],[92,72,92,77],[93,72,93,77],[94,72,94,77],[95,72,95,77],[93,66,93,71],[100,66,100,71],[101,66,101,71],[86,57,86,62],[86,66,86,71],[86,72,86,77],[86,78,86,83],[100,57,100,62],[101,57,101,62],[92,45,92,50],[92,57,92,62],[93,57,93,62],[94,57,94,62],[95,57,95,62],[96,57,96,62],[101,51,101,56],[97,51,97,56],[98,51,98,56],[99,51,99,56],[100,51,100,56],[100,45,100,50],[101,45,101,50],[88,66,88,71],[89,66,89,71],[96,72,96,77],[90,66,90,71],[91,66,91,71],[87,57,87,62],[88,57,88,62],[89,57,89,62],[90,57,90,62],[91,57,91,62],[87,66,87,71],[109,84,109,89],[107,72,107,77],[108,72,108,77],[109,72,109,77],[102,72,102,77],[103,72,103,77],[104,72,104,77],[105,72,105,77],[106,72,106,77],[109,78,109,83],[102,78,102,83],[103,78,103,83],[104,78,104,83],[105,78,105,83],[106,78,106,83],[107,78,107,83],[108,78,108,83],[87,84,87,89],[88,84,88,89],[102,84,102,89],[103,84,103,89],[104,84,104,89],[105,84,105,89],[106,84,106,89],[97,84,97,89],[89,84,89,89],[90,84,90,89],[91,84,91,89],[96,84,96,89],[98,84,98,89],[99,84,99,89],[100,84,100,89],[101,84,101,89],[94,78,94,83],[95,78,95,83],[96,78,96,83],[107,84,107,89],[108,84,108,89],[92,84,92,89],[93,84,93,89],[94,84,94,89],[95,84,95,89],[97,78,97,83],[98,78,98,83],[99,78,99,83],[100,78,100,83],[101,78,101,83],[92,78,92,83],[93,78,93,83],[110,57,110,62],[111,57,111,62],[102,57,102,62],[103,57,103,62],[104,57,104,62],[105,57,105,62],[106,57,106,62],[109,57,109,62],[107,51,107,56],[108,51,108,56],[109,51,109,56],[110,51,110,56],[109,33,109,38],[125,11,125,21],[126,11,126,21],[124,25,124,38],[125,25,125,38],[126,25,126,38],[111,33,111,38],[118,11,118,21],[120,11,120,21],[121,11,121,21],[122,11,122,21],[124,11,124,21],[129,11,129,21],[130,11,130,21],[131,11,131,21],[127,25,127,38],[128,25,128,38],[129,25,129,38],[130,25,130,38],[101,72,101,77],[94,66,94,71],[95,66,95,71],[96,66,96,71],[107,66,107,71],[108,66,108,71],[107,57,107,62],[108,57,108,62],[109,66,109,71],[102,66,102,71],[103,66,103,71],[104,66,104,71],[105,66,105,71],[106,66,106,71],[97,66,97,71],[98,66,98,71],[99,66,99,71],[102,45,102,50],[103,45,103,50],[104,45,104,50],[105,45,105,50],[106,45,106,50],[109,45,109,50],[110,45,110,50],[107,45,107,50],[135,42,135,55],[134,42,134,55],[111,51,111,56],[118,42,118,55],[173,19,173,21],[174,19,174,21],[150,2,150,17],[152,2,152,17],[153,2,153,17],[154,2,154,17],[155,2,155,17],[156,2,156,17],[165,2,165,17],[157,2,157,17],[158,2,158,17],[159,2,159,17],[160,2,160,17],[161,2,161,17],[162,2,162,17],[163,2,163,17],[164,2,164,17],[159,40,159,50],[160,40,160,50],[131,42,131,55],[131,25,131,38],[132,25,132,38],[133,25,133,38],[134,25,134,38],[135,25,135,38],[136,25,136,38],[137,25,137,38],[138,25,138,38],[139,25,139,38],[146,9,147,42],[152,23,152,26],[153,23,153,26],[154,23,154,26],[155,23,155,26],[156,23,156,26],[150,40,150,50],[139,11,139,21],[140,11,140,21],[132,11,132,21],[135,11,135,21],[136,11,136,21],[87,33,87,38],[86,33,86,38],[37,40,37,49],[100,33,100,38],[99,33,99,38],[98,33,98,38],[97,33,97,38],[96,33,96,38],[95,33,95,38],[94,33,94,38],[93,33,93,38],[92,33,92,38],[100,39,100,44],[87,45,87,50],[88,45,88,50],[89,45,89,50],[90,45,90,50],[91,45,91,50],[37,2,37,38],[93,45,93,50],[94,45,94,50],[95,45,95,50],[96,45,96,50],[51,25,51,41],[185,19,185,21],[186,19,186,21],[187,19,187,21],[188,19,188,21],[185,40,185,50],[186,40,186,50],[187,40,187,50],[188,40,188,50],[152,19,152,21],[153,19,153,21],[154,19,154,21],[155,19,155,21],[161,19,161,21],[160,19,160,21],[159,19,159,21],[158,19,158,21],[157,19,157,21],[156,19,156,21],[162,19,162,21],[163,19,163,21],[164,19,164,21],[165,19,165,21],[166,19,166,21],[172,40,172,50],[62,76,63,81],[64,73,65,75],[64,76,65,81],[181,40,181,50],[182,40,182,50],[183,40,183,50],[184,40,184,50],[177,40,177,50],[178,40,178,50],[179,40,179,50],[180,40,180,50],[173,40,173,50],[174,40,174,50],[175,40,175,50],[176,40,176,50],[108,45,108,50],[102,51,102,56],[103,51,103,56],[104,51,104,56],[105,51,105,56],[106,51,106,56],[94,39,94,44],[95,39,95,44],[96,39,96,44],[157,23,157,26],[158,23,158,26],[159,23,159,26],[160,23,160,26],[161,23,161,26],[162,23,162,26],[163,23,163,26],[164,23,164,26],[62,73,63,75],[105,33,105,38],[104,33,104,38],[150,19,150,26],[107,39,107,44],[108,39,108,44],[133,11,133,21],[134,11,134,21],[103,33,103,38],[102,33,102,38],[101,33,101,38],[91,33,91,38],[90,33,90,38],[89,33,89,38],[88,33,88,38],[158,40,158,50],[165,23,165,26],[166,23,166,26],[167,23,167,26],[168,23,168,26],[188,23,188,26],[169,23,169,26],[187,23,187,26],[170,23,170,26],[171,23,171,26],[172,23,172,26],[173,23,173,26],[174,23,174,26],[186,23,186,26],[185,23,185,26],[175,23,175,26],[176,23,176,26],[177,23,177,26],[184,23,184,26],[183,23,183,26],[178,23,178,26],[179,23,179,26],[180,23,180,26],[181,23,181,26],[182,23,182,26]]}
[null,"[insert purpose of this tool here] - Analysis"]
[]
[null,"Baseline population determined by the following criteria: "]
[null,null,null,"(1) Criteria may include line of business, member ages and date range restrictions, including which timeframe is \"year 1\" and which is \"year 2\""]
[null,null,null,"(2) Criteria may include membership restrictions (e.g., must have been a member for at least 2 months in both year 1 and year 2)"]
[null,null,null,"(3) Criteria may include geographic location limitations"]
[]
[null,"Dynamic variables are highlighted in yellow. Tables are modified when new variables are selected."]
[1,1,1,1,1,1,1,1,1,1,1,1,1,1,1,1,1,1,1,1,1,1,1,1,1,1,1,1,1,1,1,1,1,1,1,1,1,1,1,1,1,1,1,1,1,1,1,1,1,1,1,1,1,1,1,1,1,1,1,1,1,1,1,1,1,1,1,1,1,1,1,1,1,1,1,1,1,1,1,1,1,1,1,1,1,1,1,1,1,1,1,1,1,1,1,1,1,1,1]
[1,2,3,4,5,6,7,8,9,10,11,12,13,14,15,16,17,18,19,20,21,22,23,24,25,26,27,28,29,30,31,32,33,34,35,36,37,38,39,40,41,42,43,44,45,46,47,48,49,50,51,52,53,54,55,56,57,58,59,60,61,62,63,64,65,66,67,68,69,70,71,72,73,74,75,76,77,78,79,80,81,82,83,84,85,86,87,88,89,90,91,92,93,94,95,96,97,98,100]
{"$rows_left_out":180}
{"sheet":"Update Preparations","index":1,"n_rows":10,"n_cols":1,"rows_kept":10,"cut":false,"hidden":false,"merged":[]}
["RWJF Population Model -- Preparing the Tool for Data Updates"]
["See the separate Usage Instructions document for comprehensive list of update preparations."]
[]
["› Before you begin making any changes to this tool, be sure to save a new copy."]
["› Be sure to prepare your data so that it is in the same order as the existing columns on the Inputs tab."]
["› Clear the existing data by clicking the Clear Input Tab button to the right"]
["› Paste your data as values into the Input tab"]
["› Modify the formula in column IS and associated drop down menu only if necessary -- see page 3 of the Instructions for more detail"]
["› Update the RWJF Population Model tab to reflect your specific data set, time periods, etc."]
["› Protect and/or hide all worksheets excep the RWJF Population Model worksheet"]
{"$rows_left_out":1}
{"sheet":"Data Dictionary","index":2,"n_rows":347,"n_cols":3,"rows_kept":347,"cut":false,"hidden":false,"merged":[[151,0,151,4]]}
["RWJF Population Model -- Data Dictionary"]
[]
["Field Name","Data Type","Definition"]
["UNIQUE_ID","text","unique member identifier"]
["BIRTH_DATE","date","Member date of birth"]
["AGE","number (0 decimals)","Member age"]
["GENDER_CODE","text","Member gender"]
["LOB","text","Member line of business (Medicaid, Medicare, etc.)"]
["COUNTY","text","Member county of residence"]
["MEDICAL_HOME_SITE_ID","text","Medical home (or primary care physician) ID associated with the member"]
{"$rows_left_out":338}
{"sheet":"Input","index":3,"n_rows":0,"n_cols":0,"rows_kept":0,"cut":false,"hidden":false,"merged":[],"read":"part_too_large"}

{"sheet":"Drop Down Lists","index":4,"n_rows":29,"n_cols":15,"rows_kept":29,"cut":false,"hidden":false,"merged":[]}
["Drop Down Lists"]
[]
["Group",null,"PMPM Percentile 2010",null,"PMPM Percentile 2011",null,"Range",null,"% Over Threshold",null,"# of Times Above Threshold",null,"Year",null,"Flags"]
[]
[]
["All",null,0,null,0,null,"Lower Range",null,0,null,1,null,"Total",null,0]
["Group A",null,10,null,10,null,"Upper Range",null,0.1,null,2,null,2010,null,1]
["Group B",null,20,null,20,null,"Exact",null,0.15,null,3,null,2011,null,2]
[null,null,30,null,30,null,null,null,0.2,null,4,null,null,null,3]
[null,null,40,null,40,null,null,null,0.25,null,5,null,null,null,4]
{"$rows_left_out":20}
{"sheet":"Macro_Data","index":5,"n_rows":143,"n_cols":56,"rows_kept":143,"cut":false,"hidden":false,"merged":[]}
["DO NOT DELETE…",null,null,null,"Charts"]
[]
[]
[null,null,null,null,null,"% of Selected Population by Number of Chronic Conditions",null,null,null,"N","Labels",null,null,"Basis Population PMPM",null,null,null,null,null,"Number of Times Over Threshold",null,null,null,null,null,null,"Selection Illustration",null,null,null,null,null,null,null,null,"Refresh Pivot",null,null,null,null,null,null,null,"Top 10 for Bubble",null,null,null,null,null,null,"CC"]
[null,null,null,null,null,"Chronic Conditions","% of Selected Population",null,null,{"$f":"SUMIF(Input!$IJ$2:$IJ$25001,1)","v":9},0,null,null,null,null,null,null,null,null,"#","N","N2","N3","N4","Nlabels",null,null,null,null,null,null,null,null,null,null,"Row Labels","Total Spend","Occurences","Prevalence","Size","Sum of PMPM",null,null,null,"Total Spend","PMPM","Occurences","Prevalence","Size",null,null,null,"Occurences","PMPM","Total Spend","Prevalence"]
[null,null,null,null,null,0,{"$f":"SUMIF(Input!$IJ$2:$IJ$25001,1)/'RWJF Population Model'!$Z$47","v":0.5},null,null,{"$f":"SUMIF(Input!$IK$2:$IK$25001,1)","v":7},0,null,null,2010,2011,"D","Total",null,null,0,{"$f":"IF(AND('RWJF Population Model'!$AO$25<>\"\",'RWJF Population Model'!$AO$23<>\"\",'RWJF Population Model'!$AO$36=\"\",'RWJF Population Model'!$AO$40=\"\"),SUMIF(Input!$IQ$2:$IQ$25001,1,Input!$LC$2:$LC$25001),0)","v":0},{"$f":"IF(AND('RWJF Population Model'!$AO$25<>\"\",'RWJF Population Model'!$AO$23<>\"\",'RWJF Population Model'!$AO$36<>\"\",'RWJF Population Model'!$AO$40=\"\"),SUMIF(Input!$IQ$2:$IQ$25001,1,Input!$LC$2:$LC$25001),0)","v":2},{"$f":"IF(AND('RWJF Population Model'!$AO$25<>\"\",'RWJF Population Model'!$AO$23<>\"\",'RWJF Population Model'!$AO$36<>\"\",'RWJF Population Model'!$AO$40<>\"\"),SUMIF(Input!$IQ$2:$IQ$25001,1,Input!$LC$2:$LC$25001),0)","v":0},{"$f":"IF(T6>='RWJF Population Model'!$AO$40,W6,0)","v":0},{"$f":"IF(U6<>0,U6,IF(V6<>0,V6,IF(W6<>0,W6,\"\")))","v":2},null,20,40,40,null,null,null,null,null,null,"ASTHMA",3432.13,16,0.33333333333333331,149.22304347826088,6.0638339222614839,null,1,{"$f":"AJ6","v":"ASTHMA"},{"$f":"AK6","v":3432.13},{"$f":"AO6","v":6.0638339222614839},{"$f":"AL6","v":16},{"$f":"AM6","v":0.33333333333333331},{"$f":"AN6","v":149.22304347826088},null,1,{"$f":"AJ6","v":"ASTHMA"},{"$f":"AL6","v":16},{"$f":"AO6","v":6.0638339222614839},{"$f":"AK6","v":3432.13},{"$f":"AM6","v":0.33333333333333331}]
[null,null,null,null,null,1,{"$f":"SUMIF(Input!$IK$2:$IK$25001,1)/'RWJF Population Model'!$Z$47","v":0.3888888888888889},null,null,{"$f":"SUMIF(Input!$IL$2:$IL$25001,1)","v":1},0,null,null,null,null,null,null,null,null,1,{"$f":"IF(AND('RWJF Population Model'!$AO$25<>\"\",'RWJF Population Model'!$AO$23<>\"\",'RWJF Population Model'!$AO$36=\"\",'RWJF Population Model'!$AO$40=\"\"),SUMIF(Input!$IQ$2:$IQ$25001,1,Input!$LD$2:$LD$25001),0)","v":0},{"$f":"IF(AND('RWJF Population Model'!$AO$25<>\"\",'RWJF Population Model'!$AO$23<>\"\",'RWJF Population Model'!$AO$36<>\"\",'RWJF Population Model'!$AO$40=\"\"),SUMIF(Input!$IQ$2:$IQ$25001,1,Input!$LD$2:$LD$25001),0)","v":2},{"$f":"IF(AND('RWJF Population Model'!$AO$25<>\"\",'RWJF Population Model'!$AO$23<>\"\",'RWJF Population Model'!$AO$36<>\"\",'RWJF Population Model'!$AO$40<>\"\"),SUMIF(Input!$IQ$2:$IQ$25001,1,Input!$LD$2:$LD$25001),0)","v":0},{"$f":"IF(T7>='RWJF Population Model'!$AO$40,W7,0)","v":0},{"$f":"IF(U7<>0,U7,IF(V7<>0,V7,IF(W7<>0,W7,\"\")))","v":2},null,20,40,40,null,null,null,null,null,null,"DM",616.32000000000005,1,2.0833333333333332E-2,26.796521739130437,1.088904593639576,null,2,{"$f":"AJ7","v":"DM"},{"$f":"AK7","v":616.32000000000005},{"$f":"AO7","v":1.088904593639576},{"$f":"AL7","v":1},{"$f":"AM7","v":2.0833333333333332E-2},{"$f":"AN7","v":26.796521739130437},null,2,{"$f":"AJ7","v":"DM"},{"$f":"AL7","v":1},{"$f":"AO7","v":1.088904593639576},{"$f":"AK7","v":616.32000000000005},{"$f":"AM7","v":2.0833333333333332E-2}]
[null,null,null,null,null,2,{"$f":"SUMIF(Input!$IL$2:$IL$25001,1)/'RWJF Population Model'!$Z$47","v":5.5555555555555552E-2},null,null,{"$f":"SUMIF(Input!$IM$2:$IM$25001,1)","v":0},0,null,null,{"$f":"SUMIF(Input!$IQ$2:$IQ$25001,1,Input!$EG$2:$EG$25001)/SUMIF(Input!$IQ$2:$IQ$25001,1,Input!$EQ$2:$EQ$25001)","v":204.79124999999999},{"$f":"SUMIF(Input!$IQ$2:$IQ$25001,1,Input!$EJ$2:$EJ$25001)/SUMIF(Input!$IQ$2:$IQ$25001,1,Input!$ER$2:$ER$25001)","v":381.77538461538472},{"$f":"O8-N8","v":176.98413461538473},{"$f":"SUMIF(Input!$IQ$2:$IQ$25001,1,Input!$JD$2:$JD$25001)/SUMIF(Input!$IQ$2:$IQ$25001,1,Input!$JF$2:$JF$25001)","v":291.61365566037739},null,null,2,{"$f":"IF(AND('RWJF Population Model'!$AO$25<>\"\",'RWJF Population Model'!$AO$23<>\"\",'RWJF Population Model'!$AO$36=\"\",'RWJF Population Model'!$AO$40=\"\"),SUMIF(Input!$IQ$2:$IQ$25001,1,Input!$LE$2:$LE$25001),0)","v":0},{"$f":"IF(AND('RWJF Population Model'!$AO$25<>\"\",'RWJF Population Model'!$AO$23<>\"\",'RWJF Population Model'!$AO$36<>\"\",'RWJF Population Model'!$AO$40=\"\"),SUMIF(Input!$IQ$2:$IQ$25001,1,Input!$LE$2:$LE$25001),0)","v":1},{"$f":"IF(AND('RWJF Population Model'!$AO$25<>\"\",'RWJF Population Model'!$AO$23<>\"\",'RWJF Population Model'!$AO$36<>\"\",'RWJF Population Model'!$AO$40<>\"\"),SUMIF(Input!$IQ$2:$IQ$25001,1,Input!$LE$2:$LE$25001),0)","v":0},{"$f":"IF(T8>='RWJF Population Model'!$AO$40,W8,0)","v":0},1,null,null,null,null,null,null,null,null,null,null,"SPINA BIFIDA SCI",0,0,0,0,0,null,3,"SPINA BIFIDA SCI",0,0,0,0,0,null,3,"SPINA BIFIDA SCI",0,0,0,0]
[null,null,null,null,null,3,{"$f":"SUMIF(Input!$IM$2:$IM$25001,1)/'RWJF Population Model'!$Z$47","v":0},null,null,{"$f":"SUMIF(Input!$IN$2:$IN$25001,1)","v":1},0,null,null,null,null,null,null,null,null,3,{"$f":"IF(AND('RWJF Population Model'!$AO$25<>\"\",'RWJF Population Model'!$AO$23<>\"\",'RWJF Population Model'!$AO$36=\"\",'RWJF Population Model'!$AO$40=\"\"),SUMIF(Input!$IQ$2:$IQ$25001,1,Input!$LF$2:$LF$25001),0)","v":0},{"$f":"IF(AND('RWJF Population Model'!$AO$25<>\"\",'RWJF Population Model'!$AO$23<>\"\",'RWJF Population Model'!$AO$36<>\"\",'RWJF Population Model'!$AO$40=\"\"),SUMIF(Input!$IQ$2:$IQ$25001,1,Input!$LF$2:$LF$25001),0)","v":2},{"$f":"IF(AND('RWJF Population Model'!$AO$25<>\"\",'RWJF Population Model'!$AO$23<>\"\",'RWJF Population Model'!$AO$36<>\"\",'RWJF Population Model'!$AO$40<>\"\"),SUMIF(Input!$IQ$2:$IQ$25001,1,Input!$LF$2:$LF$25001),0)","v":0},{"$f":"IF(T9>='RWJF Population Model'!$AO$40,W9,0)","v":0},2,null,{"$f":"IF('RWJF Population Model'!$AO$40=\"\",\"\",\"Selected Population:\")","v":""},null,null,null,null,null,null,null,null,"NEOPLASM MALIGNANT",0,0,0,0,0,null,4,"NEOPLASM MALIGNANT",0,0,0,0,0,null,4,"NEOPLASM MALIGNANT",0,0,0,0]
[null,null,null,null,null,4,{"$f":"SUMIF(Input!$IN$2:$IN$25001,1)/'RWJF Population Model'!$Z$47","v":5.5555555555555552E-2},null,null,{"$f":"SUMIF(Input!$IO$2:$IO$25001,1)","v":0},0,null,null,null,null,null,null,null,null,4,{"$f":"IF(AND('RWJF Population Model'!$AO$25<>\"\",'RWJF Population Model'!$AO$23<>\"\",'RWJF Population Model'!$AO$36=\"\",'RWJF Population Model'!$AO$40=\"\"),SUMIF(Input!$IQ$2:$IQ$25001,1,Input!$LG$2:$LG$25001),0)","v":0},{"$f":"IF(AND('RWJF Population Model'!$AO$25<>\"\",'RWJF Population Model'!$AO$23<>\"\",'RWJF Population Model'!$AO$36<>\"\",'RWJF Population Model'!$AO$40=\"\"),SUMIF(Input!$IQ$2:$IQ$25001,1,Input!$LG$2:$LG$25001),0)","v":1},{"$f":"IF(AND('RWJF Population Model'!$AO$25<>\"\",'RWJF Population Model'!$AO$23<>\"\",'RWJF Population Model'!$AO$36<>\"\",'RWJF Population Model'!$AO$40<>\"\"),SUMIF(Input!$IQ$2:$IQ$25001,1,Input!$LG$2:$LG$25001),0)","v":0},{"$f":"IF(T10>='RWJF Population Model'!$AO$40,W10,0)","v":0},1,null,{"$f":"CONCATENATE(\"Medical and Rx PMPM of Initial Crossection\",\" - \",AH10)","v":"Medical and Rx PMPM of Initial Crossection - $292"},null,null,null,null,{"$f":"ROUND('RWJF Population Model'!$AO$27,0)","v":292},null,{"$f":"IF(AND(AF10>=1000,AF10<10000),CONCATENATE(\"$\",LEFT(AF10,1),\",\",MID(AF10,2,3)),IF(AF10>=10000,CONCATENATE(\"$\",LEFT(AF10,2),\",\",MID(AF10,3,3)),CONCATENATE(\"$\",LEFT(AF10,3))))","v":"$292"},null,"LUPUS CONN TISSUE DISORDERS",0,0,0,0,0,null,5,"LUPUS CONN TISSUE DISORDERS",0,0,0,0,0,null,5,"LUPUS CONN TISSUE DISORDERS",0,0,0,0]
{"$rows_left_out":133}